BDBM67057 1-(4-chlorobenzyl)-5-methyl-isatin::1-[(4-chlorophenyl)methyl]-5-methyl-indole-2,3-dione::1-[(4-chlorophenyl)methyl]-5-methylindole-2,3-dione::MLS002473341::SMR001397435::cid_2768681
SMILES Cc1ccc2N(Cc3ccc(Cl)cc3)C(=O)C(=O)c2c1
InChI Key InChIKey=VSQRATQPXJILRW-UHFFFAOYSA-N
Data  1 EC50
  Tab Delimited (TSV)   2D SDfile   Computed 3D by Vconf -m prep SDfile
Find this compound or compounds like it in BindingDB:
Activity Spreadsheet -- Enzyme Inhibition Constant Data from BindingDB
Found 1 hit for monomerid = 67057
TargetBcl-2-like protein 11(Homo sapiens (Human))
Broad Institute
Curated by PubChem BioAssay
LigandPNGBDBM67057(1-(4-chlorobenzyl)-5-methyl-isatin | 1-[(4-chlorop...)
Affinity DataEC50: >3.50E+5nM. Assay description: Keywords: apoptosis, BH3 domain, Bcl2-A1, BIM, caspase, cancer Primary Collaborator: Todd Golub, Broad Institute, golub@broadinstitute.org Assay Over...
In DepthDetails PCBioAssay