BDBM67064 MLS002474476::N-[(2R,3S)-3-methyl-2-[[methyl-[(4-phenylphenyl)methyl]amino]methyl]-6-oxidanylidene-5-[(2R)-1-oxidanylpropan-2-yl]-2,3,4,7-tetrahydro-1,5-benzoxazonin-9-yl]benzenesulfonamide::N-[(2R,3S)-5-[(1R)-2-hydroxy-1-methyl-ethyl]-6-keto-3-methyl-2-[[methyl-(4-phenylbenzyl)amino]methyl]-2,3,4,7-tetrahydro-1,5-benzoxazonin-9-yl]benzenesulfonamide::N-[(2R,3S)-5-[(2R)-1-hydroxypropan-2-yl]-3-methyl-2-[[methyl-[(4-phenylphenyl)methyl]amino]methyl]-6-oxo-2,3,4,7-tetrahydro-1,5-benzoxazonin-9-yl]benzenesulfonamide::SMR001398637::cid_44202701
SMILES C[C@H](CO)N1C[C@H](C)[C@H](CN(C)Cc2ccc(cc2)-c2ccccc2)Oc2ccc(NS(=O)(=O)c3ccccc3)cc2CC1=O
InChI Key InChIKey=QMWRRMYICQUONI-ULQPQYINSA-N
Data  1 EC50
  Tab Delimited (TSV)   2D SDfile   Computed 3D by Vconf -m prep SDfile
Find this compound or compounds like it in BindingDB:
Activity Spreadsheet -- Enzyme Inhibition Constant Data from BindingDB
Found 1 hit for monomerid = 67064
TargetBcl-2-like protein 11(Homo sapiens (Human))
Broad Institute
Curated by PubChem BioAssay
LigandPNGBDBM67064(MLS002474476 | N-[(2R,3S)-3-methyl-2-[[methyl-[(4-...)
Affinity DataEC50: >3.50E+5nM. Assay description: Keywords: apoptosis, BH3 domain, Bcl2-A1, BIM, caspase, cancer Primary Collaborator: Todd Golub, Broad Institute, golub@broadinstitute.org Assay Over...
In DepthDetails PCBioAssay