BDBM67070 2-methyl-N-(5-morpholin-4-ylsulfonyl-2-piperidin-1-yl-phenyl)propanamide::2-methyl-N-(5-morpholin-4-ylsulfonyl-2-piperidin-1-ylphenyl)propanamide::2-methyl-N-(5-morpholinosulfonyl-2-piperidino-phenyl)propionamide::2-methyl-N-[5-(4-morpholinylsulfonyl)-2-(1-piperidinyl)phenyl]propanamide::MLS002248035::SMR001315518::cid_5161119
SMILES CC(C)C(=O)Nc1cc(ccc1N1CCCCC1)S(=O)(=O)N1CCOCC1
InChI Key InChIKey=VFDJYMDBVTXVRB-UHFFFAOYSA-N
Data  1 EC50
  Tab Delimited (TSV)   2D SDfile   Computed 3D by Vconf -m prep SDfile
Find this compound or compounds like it in BindingDB:
Activity Spreadsheet -- Enzyme Inhibition Constant Data from BindingDB
Found 1 hit for monomerid = 67070
TargetBcl-2-like protein 11(Homo sapiens (Human))
Broad Institute
Curated by PubChem BioAssay
LigandPNGBDBM67070(2-methyl-N-(5-morpholin-4-ylsulfonyl-2-piperidin-1...)
Affinity DataEC50: >3.50E+5nM. Assay description: Keywords: apoptosis, BH3 domain, Bcl2-A1, BIM, caspase, cancer Primary Collaborator: Todd Golub, Broad Institute, golub@broadinstitute.org Assay Over...
In DepthDetails PCBioAssay