BDBM67771 5-bromanyl-N-(5-butan-2-yl-2-oxidanyl-phenyl)pyridine-3-carboxamide::5-bromo-N-(2-hydroxy-5-sec-butyl-phenyl)nicotinamide::5-bromo-N-(5-butan-2-yl-2-hydroxyphenyl)-3-pyridinecarboxamide::5-bromo-N-(5-butan-2-yl-2-hydroxyphenyl)pyridine-3-carboxamide::5-bromo-N-(5-sec-butyl-2-hydroxyphenyl)nicotinamide::MLS000062368::SMR000073014::cid_2941334
SMILES CCC(C)c1ccc(O)c(NC(=O)c2cncc(Br)c2)c1
InChI Key InChIKey=ICKUJBPPTAGAHH-UHFFFAOYSA-N
Data  3 IC50
  Tab Delimited (TSV)   2D SDfile   Computed 3D by Vconf -m prep SDfile
Find this compound or compounds like it in BindingDB:
Activity Spreadsheet -- Enzyme Inhibition Constant Data from BindingDB
Found 3 hits for monomerid = 67771
TargetDNA damage-inducible transcript 3 protein(Mus musculus)
Emory University
Curated by PubChem BioAssay
LigandPNGBDBM67771(5-bromanyl-N-(5-butan-2-yl-2-oxidanyl-phenyl)pyrid...)
Affinity DataIC50:  7.32E+3nM. Assay description: NIH Molecular Libraries Screening Centers Network [MLSCN] Emory Chemical Biology Discovery Center in MLSCN Assay provider: Dr. Randal Kaufman, Univer...
In DepthDetails PCBioAssay
TargetDNA damage-inducible transcript 3 protein(Mus musculus)
Emory University
Curated by PubChem BioAssay
LigandPNGBDBM67771(5-bromanyl-N-(5-butan-2-yl-2-oxidanyl-phenyl)pyrid...)
Affinity DataIC50:  7.32E+3nM. Assay description: NIH Molecular Libraries Screening Centers Network [MLSCN] Emory Chemical Biology Discovery Center in MLSCN Assay provider: Dr. Randal Kaufman, Univer...
In DepthDetails PCBioAssay
TargetX-box-binding protein 1(Homo sapiens (Human))
Emory University
Curated by PubChem BioAssay
LigandPNGBDBM67771(5-bromanyl-N-(5-butan-2-yl-2-oxidanyl-phenyl)pyrid...)
Affinity DataIC50:  1.00E+4nM. Assay description: NIH Molecular Libraries Screening Centers Network [MLSCN] Emory Chemical Biology Discovery Center in MLSCN Assay provider: Dr. Randal Kaufman, Univer...
In DepthDetails PCBioAssay