BDBM68136 MLS000728341::PbTx-6::SMR000265080::cid_16195253
SMILES C[C@@H]1CC2OC3CC4OC(=O)C=C(C)C4O[C@@]3(C)CC2OC2CC[C@@]3(C)O[C@@]4(C)CC5OC6CC7O[C@@]8(C)C(O)CC(CC(=C)C=O)OC8CC7OC6C6OC6C[C@@]5(C)OC4CC3OC12
InChI Key InChIKey=XXPMBLWPRXRSBN-MNLYNUCISA-N
Data  3 IC50
  Tab Delimited (TSV)   2D SDfile   Computed 3D by Vconf -m prep SDfile
Find this compound or compounds like it in BindingDB:
Activity Spreadsheet -- Enzyme Inhibition Constant Data from BindingDB
Found 3 hits for monomerid = 68136
TargetDNA damage-inducible transcript 3 protein(Mus musculus)
Emory University
Curated by PubChem BioAssay
LigandPNGBDBM68136(MLS000728341 | PbTx-6 | SMR000265080 | cid_1619525...)
Affinity DataIC50:  980nM. Assay description: NIH Molecular Libraries Screening Centers Network [MLSCN] Emory Chemical Biology Discovery Center in MLSCN Assay provider: Dr. Randal Kaufman, Univer...
In DepthDetails PCBioAssay
TargetX-box-binding protein 1(Homo sapiens (Human))
Emory University
Curated by PubChem BioAssay
LigandPNGBDBM68136(MLS000728341 | PbTx-6 | SMR000265080 | cid_1619525...)
Affinity DataIC50:  4.77E+3nM. Assay description: NIH Molecular Libraries Screening Centers Network [MLSCN] Emory Chemical Biology Discovery Center in MLSCN Assay provider: Dr. Randal Kaufman, Univer...
In DepthDetails PCBioAssay
TargetDNA damage-inducible transcript 3 protein(Mus musculus)
Emory University
Curated by PubChem BioAssay
LigandPNGBDBM68136(MLS000728341 | PbTx-6 | SMR000265080 | cid_1619525...)
Affinity DataIC50:  980nM. Assay description: NIH Molecular Libraries Screening Centers Network [MLSCN] Emory Chemical Biology Discovery Center in MLSCN Assay provider: Dr. Randal Kaufman, Univer...
In DepthDetails PCBioAssay