BDBM68282 Bengamide B
SMILES CCCCCCCCCCCCCOC(=O)C1CCC(NC(=O)[C@H](OC)[C@H](O)[C@@H](O)[C@H](O)\C=C\C(C)C)C(=O)N(C)C1
InChI Key InChIKey=IVVDPBRFHAVLGS-MTSMUQHNSA-N
Data  2 IC50
  Tab Delimited (TSV)   2D SDfile   Computed 3D by Vconf -m prep SDfile
Find this compound or compounds like it in BindingDB:
Activity Spreadsheet -- Enzyme Inhibition Constant Data from BindingDB
Found 2 hits for monomerid = 68282
TargetMethionine aminopeptidase 2(Homo sapiens (Human))
The Johns Hopkins University
LigandPNGBDBM68282(Bengamide B)
Affinity DataIC50:  1.79E+4nM. Assay description: The determined effects of seven bengamide analogs on the enzymatic activity of both recombinated human MetAP1 and MetAP2 in vitro.
In DepthDetails ArticlePubMed
TargetMethionine aminopeptidase 1(Homo sapiens (Human))
The Johns Hopkins University
LigandPNGBDBM68282(Bengamide B)
Affinity DataIC50:  2.93E+4nM. Assay description: The determined effects of seven bengamide analogs on the enzymatic activity of both recombinated human MetAP1 and MetAP2 in vitro.
In DepthDetails ArticlePubMed