BDBM68313 MLS-0435539.0001::N-(2-methoxy-5-morpholin-4-ylsulfonyl-phenyl)-4,5,6,7,8,9-hexahydrocycloocta[b]thiophene-2-carboxamide::N-(2-methoxy-5-morpholin-4-ylsulfonylphenyl)-4,5,6,7,8,9-hexahydrocycloocta[b]thiophene-2-carboxamide::N-(2-methoxy-5-morpholinosulfonyl-phenyl)-4,5,6,7,8,9-hexahydrocycloocta[b]thiophene-2-carboxamide::N-[2-methoxy-5-(4-morpholinylsulfonyl)phenyl]-4,5,6,7,8,9-hexahydrocycloocta[b]thiophene-2-carboxamide::cid_16310040
SMILES COc1ccc(cc1NC(=O)c1cc2CCCCCCc2s1)S(=O)(=O)N1CCOCC1
InChI Key InChIKey=DMFJVESKRGCNOS-UHFFFAOYSA-N
Data  3 IC50  2 EC50
  Tab Delimited (TSV)   2D SDfile   Computed 3D by Vconf -m prep SDfile
Find this compound or compounds like it in BindingDB:
Activity Spreadsheet -- Enzyme Inhibition Constant Data from BindingDB
Found 5 hits for monomerid = 68313
TargetCannabinoid receptor 2(Homo sapiens (Human))
Burnham Center For Chemical Genomics
Curated by PubChem BioAssay
LigandPNGBDBM68313(MLS-0435539.0001 | N-(2-methoxy-5-morpholin-4-ylsu...)
Affinity DataIC50: >3.20E+4nM. Assay description: Data Source: Sanford-Burnham Center for Chemical Genomics Source Affiliation: Sanford-Burnham Medical Research Institute (SBMRI, San Diego, CA) Netw...
In DepthDetails PCBioAssay
TargetG-protein coupled receptor 35(Homo sapiens (Human))
Burnham Center For Chemical Genomics
Curated by PubChem BioAssay
LigandPNGBDBM68313(MLS-0435539.0001 | N-(2-methoxy-5-morpholin-4-ylsu...)
Affinity DataEC50: >3.20E+4nM. Assay description: Data Source: Sanford-Burnham Center for Chemical Genomics Source Affiliation: Sanford-Burnham Medical Research Institute (SBMRI) Network: NIH Molec...
In DepthDetails PCBioAssay
TargetCannabinoid receptor 1(Homo sapiens (Human))
Burnham Center For Chemical Genomics
Curated by PubChem BioAssay
LigandPNGBDBM68313(MLS-0435539.0001 | N-(2-methoxy-5-morpholin-4-ylsu...)
Affinity DataIC50:  1.82E+4nM. Assay description: Data Source: Sanford-Burnham Center for Chemical Genomics Source Affiliation: Sanford-Burnham Medical Research Institute (SBMRI, San Diego, CA) Netw...
In DepthDetails PCBioAssay
TargetCannabinoid receptor 2(Homo sapiens (Human))
Burnham Center For Chemical Genomics
Curated by PubChem BioAssay
LigandPNGBDBM68313(MLS-0435539.0001 | N-(2-methoxy-5-morpholin-4-ylsu...)
Affinity DataEC50: >3.20E+4nM. Assay description: Data Source: Sanford-Burnham Center for Chemical Genomics Source Affiliation: Sanford-Burnham Medical Research Institute (SBMRI, San Diego, CA) Net...
In DepthDetails PCBioAssay
TargetG-protein coupled receptor 35(Homo sapiens (Human))
Burnham Center For Chemical Genomics
Curated by PubChem BioAssay
LigandPNGBDBM68313(MLS-0435539.0001 | N-(2-methoxy-5-morpholin-4-ylsu...)
Affinity DataIC50: >3.20E+4nM. Assay description: Data Source: Sanford-Burnham Center for Chemical Genomics Source Affiliation: Sanford-Burnham Medical Research Institute (SBMRI, San Diego, CA) Netw...
In DepthDetails PCBioAssay