BDBM73265 1-(2,3-dihydro-1,4-benzodioxin-3-yl)-4H-[1,2,4]triazolo[3,4-c][1,4]benzothiazine::MLS000054875::SMR000066453::cid_2998021
SMILES C1Oc2ccccc2OC1c1nnc2CSc3ccccc3-n12
InChI Key InChIKey=YNOCYKOVZIRAHX-UHFFFAOYSA-N
Data  1 EC50
  Tab Delimited (TSV)   2D SDfile   Computed 3D by Vconf -m prep SDfile
Find this compound or compounds like it in BindingDB:
Activity Spreadsheet -- Enzyme Inhibition Constant Data from BindingDB
Found 1 hit for monomerid = 73265
TargetProtein LANA1(Human herpesvirus 8)
Broad Institute
Curated by PubChem BioAssay
LigandPNGBDBM73265(1-(2,3-dihydro-1,4-benzodioxin-3-yl)-4H-[1,2,4]tri...)
Affinity DataEC50: >7.50E+4nM. Assay description: Primary Collaborators: Kenneth Kaye,Brigham & Womens,Boston MA,kkaye@rics.bwh.harvard.edu,617-525-4256 Chantal Beauchemin,Brigham & Womens,Boston MA,...
In DepthDetails PCBioAssay