BDBM73428 (3Z)-3-[2-(4-fluorophenyl)-2-keto-ethylidene]-1-phenyl-4H-quinoxalin-2-one::(3Z)-3-[2-(4-fluorophenyl)-2-oxidanylidene-ethylidene]-1-phenyl-4H-quinoxalin-2-one::(3Z)-3-[2-(4-fluorophenyl)-2-oxoethylidene]-1-phenyl-4H-quinoxalin-2-one::3-[2-(4-fluorophenyl)-2-oxoethylidene]-1-phenyl-3,4-dihydro-2(1H)-quinoxalinone::MLS000533699::SMR000141077::cid_6897339
SMILES Fc1ccc(cc1)C(=O)Cc1nc2ccccc2n(-c2ccccc2)c1=O
InChI Key InChIKey=SMRYKBKKEVJTPL-UHFFFAOYSA-N
Data  2 EC50
  Tab Delimited (TSV)   2D SDfile   Computed 3D by Vconf -m prep SDfile
Find this compound or compounds like it in BindingDB:
Activity Spreadsheet -- Enzyme Inhibition Constant Data from BindingDB
Found 2 hits for monomerid = 73428
TargetCorticotropin-releasing factor-binding protein(Homo sapiens (Human))
Burnham Center For Chemical Genomics
Curated by PubChem BioAssay
LigandPNGBDBM73428((3Z)-3-[2-(4-fluorophenyl)-2-keto-ethylidene]-1-ph...)
Affinity DataEC50:  7.18E+3nM. Assay description: Data Source: Sanford-Burnham Center for Chemical Genomics (SBCCG) Source Affiliation: Sanford-Burnham Medical Research Institute (SBMRI, San Diego, C...
In DepthDetails PCBioAssay
TargetProtein LANA1(Human herpesvirus 8)
Broad Institute
Curated by PubChem BioAssay
LigandPNGBDBM73428((3Z)-3-[2-(4-fluorophenyl)-2-keto-ethylidene]-1-ph...)
Affinity DataEC50: >7.50E+4nM. Assay description: Primary Collaborators: Kenneth Kaye,Brigham & Womens,Boston MA,kkaye@rics.bwh.harvard.edu,617-525-4256 Chantal Beauchemin,Brigham & Womens,Boston MA,...
In DepthDetails PCBioAssay