BDBM7410 (2 Z,3 E)-6-Iodoindirubin-3 -oxime::3-[(2Z,3E)-3-(hydroxyimino)-2,3-dihydro-1H-indol-2-ylidene]-6-iodo-2,3-dihydro-1H-indol-2-one::6-iodoindirubin-3 -oxime::indirubin deriv. 7c
SMILES Ic1ccc2C(C(=O)Nc2c1)c1[nH]c2ccccc2c1N=O
InChI Key InChIKey=ZMTFCRAERVFMKE-UHFFFAOYSA-N
Data  3 IC50
  Tab Delimited (TSV)   2D SDfile   Computed 3D by Vconf -m prep SDfile
Find this compound or compounds like it in BindingDB:
Activity Spreadsheet -- Enzyme Inhibition Constant Data from BindingDB
Found 3 hits for monomerid = 7410
TargetCyclin-dependent kinase 5 activator 1 [99-307](Homo sapiens (Human))
University Of Athens
LigandPNGBDBM7410((2 Z,3 E)-6-Iodoindirubin-3 -oxime | 3-[(2Z,3E)-3-...)
Affinity DataIC50:  300nMT: 2°C. Assay description: Kinase activities were assayed in buffers containing substrate, enzyme, and inhibitor at 30 °C in the presence of 15 uM ATP/ [gamma-32P] ATP. 32...
In DepthDetails ArticlePubMed
TargetCyclin-dependent kinase 1/G2/mitotic-specific cyclin-B(Marthasterias glacialis (starfish))
University Of Athens
LigandPNGBDBM7410((2 Z,3 E)-6-Iodoindirubin-3 -oxime | 3-[(2Z,3E)-3-...)
Affinity DataIC50:  1.30E+3nMpH: 7.2 T: 2°C. Assay description: Kinase activities were assayed in buffers containing substrate, enzyme, and inhibitor at 30 °C in the presence of 15 uM ATP/ [gamma-32P] ATP. 32...
In DepthDetails ArticlePubMed
TargetGlycogen synthase kinase-3 beta(Porcine)
University Of Athens
LigandPNGBDBM7410((2 Z,3 E)-6-Iodoindirubin-3 -oxime | 3-[(2Z,3E)-3-...)
Affinity DataIC50:  10nMT: 2°C. Assay description: Kinase activities were assayed in buffers containing substrate, enzyme, and inhibitor at 30 °C in the presence of 15 uM ATP/ [gamma-32P] ATP. 32...
In DepthDetails ArticlePubMed