BDBM7420 (2 Z)-6-Bromo-5-methylindirubin::6-bromo-5-methyl-3-[(2Z)-3-oxo-2,3-dihydro-1H-indol-2-ylidene]-2,3-dihydro-1H-indol-2-one::6-bromo-5-methylindirubin::indirubin deriv. 5f
SMILES Cc1cc2\C(C(=O)Nc2cc1Br)=C1\Nc2ccccc2C1=O
InChI Key InChIKey=OHTVQVFZQAFWDU-PFONDFGASA-N
Data  3 IC50
  Tab Delimited (TSV)   2D SDfile   Computed 3D by Vconf -m prep SDfile
Find this compound or compounds like it in BindingDB:
Activity Spreadsheet -- Enzyme Inhibition Constant Data from BindingDB
Found 3 hits for monomerid = 7420
TargetCyclin-dependent kinase 5 activator 1 [99-307](Homo sapiens (Human))
University Of Athens
LigandPNGBDBM7420((2 Z)-6-Bromo-5-methylindirubin | 6-bromo-5-methyl...)
Affinity DataIC50:  6.00E+4nMT: 2°C. Assay description: Kinase activities were assayed in buffers containing substrate, enzyme, and inhibitor at 30 °C in the presence of 15 uM ATP/ [gamma-32P] ATP. 32...
In DepthDetails ArticlePubMed
TargetCyclin-dependent kinase 1/G2/mitotic-specific cyclin-B(Marthasterias glacialis (starfish))
University Of Athens
LigandPNGBDBM7420((2 Z)-6-Bromo-5-methylindirubin | 6-bromo-5-methyl...)
Affinity DataIC50:  3.00E+4nMT: 2°C. Assay description: Kinase activities were assayed in buffers containing substrate, enzyme, and inhibitor at 30 °C in the presence of 15 uM ATP/ [gamma-32P] ATP. 32...
In DepthDetails ArticlePubMed
TargetGlycogen synthase kinase-3 beta(Porcine)
University Of Athens
LigandPNGBDBM7420((2 Z)-6-Bromo-5-methylindirubin | 6-bromo-5-methyl...)
Affinity DataIC50:  25nMT: 2°C. Assay description: Kinase activities were assayed in buffers containing substrate, enzyme, and inhibitor at 30 °C in the presence of 15 uM ATP/ [gamma-32P] ATP. 32...
In DepthDetails ArticlePubMed