BDBM7428 (2 Z,3 E)-6-Bromo-5-nitroindirubin-3 -acetoxime::6-Bromo-5-nitroindirubin-3 -acetoxime::[(3E)-2-[(3Z)-6-bromo-5-nitro-2-oxo-2,3-dihydro-1H-indol-3-ylidene]-2,3-dihydro-1H-indol-3-ylidene]amino acetate::indirubin deriv. 8g
SMILES CC(=O)[O+]=Nc1c([nH]c2ccccc12)-[c-]1c2cc(c(Br)cc2[nH]c1=O)[N+]([O-])=O
InChI Key InChIKey=RXXZLIIVHLKXCC-UHFFFAOYSA-N
Data  3 IC50
  Tab Delimited (TSV)   2D SDfile   Computed 3D by Vconf -m prep SDfile
Find this compound or compounds like it in BindingDB:
Activity Spreadsheet -- Enzyme Inhibition Constant Data from BindingDB
Found 3 hits for monomerid = 7428
TargetCyclin-dependent kinase 5 activator 1 [99-307](Homo sapiens (Human))
University Of Athens
LigandPNGBDBM7428((2 Z,3 E)-6-Bromo-5-nitroindirubin-3 -acetoxime | ...)
Affinity DataIC50:  3.10E+4nMT: 2°C. Assay description: Kinase activities were assayed in buffers containing substrate, enzyme, and inhibitor at 30 °C in the presence of 15 uM ATP/ [gamma-32P] ATP. 32...
In DepthDetails ArticlePubMed
TargetCyclin-dependent kinase 1/G2/mitotic-specific cyclin-B(Marthasterias glacialis (starfish))
University Of Athens
LigandPNGBDBM7428((2 Z,3 E)-6-Bromo-5-nitroindirubin-3 -acetoxime | ...)
Affinity DataIC50:  1.10E+4nMT: 2°C. Assay description: Kinase activities were assayed in buffers containing substrate, enzyme, and inhibitor at 30 °C in the presence of 15 uM ATP/ [gamma-32P] ATP. 32...
In DepthDetails ArticlePubMed
TargetGlycogen synthase kinase-3 beta(Porcine)
University Of Athens
LigandPNGBDBM7428((2 Z,3 E)-6-Bromo-5-nitroindirubin-3 -acetoxime | ...)
Affinity DataIC50:  6nMT: 2°C. Assay description: Kinase activities were assayed in buffers containing substrate, enzyme, and inhibitor at 30 °C in the presence of 15 uM ATP/ [gamma-32P] ATP. 32...
In DepthDetails ArticlePubMed