BDBM74293 MLS002181622::N-[3-(2,3-dihydro-1,4-benzodioxin-3-ylmethylamino)-3-keto-propyl]-2-methoxy-benzamide::N-[3-(2,3-dihydro-1,4-benzodioxin-3-ylmethylamino)-3-oxidanylidene-propyl]-2-methoxy-benzamide::N-[3-(2,3-dihydro-1,4-benzodioxin-3-ylmethylamino)-3-oxopropyl]-2-methoxybenzamide::SMR001270652::cid_25162247
SMILES COc1ccccc1C(=O)NCCC(=O)NCC1COc2ccccc2O1
InChI Key InChIKey=MOKZKGIEWRAGAL-UHFFFAOYSA-N
Data  1 EC50
  Tab Delimited (TSV)   2D SDfile   Computed 3D by Vconf -m prep SDfile
Find this compound or compounds like it in BindingDB:
Activity Spreadsheet -- Enzyme Inhibition Constant Data from BindingDB
Found 1 hit for monomerid = 74293
TargetProtein LANA1(Human herpesvirus 8)
Broad Institute
Curated by PubChem BioAssay
LigandPNGBDBM74293(MLS002181622 | N-[3-(2,3-dihydro-1,4-benzodioxin-3...)
Affinity DataEC50: >7.50E+4nM. Assay description: Primary Collaborators: Kenneth Kaye,Brigham & Womens,Boston MA,kkaye@rics.bwh.harvard.edu,617-525-4256 Chantal Beauchemin,Brigham & Womens,Boston MA,...
In DepthDetails PCBioAssay