BDBM74358 MLS002162958::N-[2-(4-acetamidoanilino)-2-keto-ethyl]-N-ethyl-cyclopentanecarboxamide::N-[2-(4-acetamidoanilino)-2-oxoethyl]-N-ethylcyclopentanecarboxamide::N-[2-[(4-acetamidophenyl)amino]-2-oxidanylidene-ethyl]-N-ethyl-cyclopentanecarboxamide::SMR001245352::cid_4787805
SMILES CCN(CC(=O)Nc1ccc(NC(C)=O)cc1)C(=O)C1CCCC1
InChI Key InChIKey=VABNBWJVUWADMH-UHFFFAOYSA-N
Data  1 EC50
  Tab Delimited (TSV)   2D SDfile   Computed 3D by Vconf -m prep SDfile
Find this compound or compounds like it in BindingDB:
Activity Spreadsheet -- Enzyme Inhibition Constant Data from BindingDB
Found 1 hit for monomerid = 74358
TargetProtein LANA1(Human herpesvirus 8)
Broad Institute
Curated by PubChem BioAssay
LigandPNGBDBM74358(MLS002162958 | N-[2-(4-acetamidoanilino)-2-keto-et...)
Affinity DataEC50: >7.50E+4nM. Assay description: Primary Collaborators: Kenneth Kaye,Brigham & Womens,Boston MA,kkaye@rics.bwh.harvard.edu,617-525-4256 Chantal Beauchemin,Brigham & Womens,Boston MA,...
In DepthDetails PCBioAssay