BDBM76191 1-(4-methyl-3-piperidin-1-ylsulfonyl-phenyl)-3-(phenylmethyl)thiourea::1-[4-methyl-3-(1-piperidinylsulfonyl)phenyl]-3-(phenylmethyl)thiourea::1-benzyl-3-(4-methyl-3-piperidin-1-ylsulfonylphenyl)thiourea::1-benzyl-3-(4-methyl-3-piperidinosulfonyl-phenyl)thiourea::MLS001002308::SMR000368838::cid_4673237
SMILES Cc1ccc(NC(=S)NCc2ccccc2)cc1S(=O)(=O)N1CCCCC1
InChI Key InChIKey=HRFVMXKRYBXNOG-UHFFFAOYSA-N
Data  4 IC50
  Tab Delimited (TSV)   2D SDfile   Computed 3D by Vconf -m prep SDfile
Find this compound or compounds like it in BindingDB:
Activity Spreadsheet -- Enzyme Inhibition Constant Data from BindingDB
Found 4 hits for monomerid = 76191
TargetIntestinal-type alkaline phosphatase(Homo sapiens (Human))
Burnham Center For Chemical Genomics
Curated by PubChem BioAssay
LigandPNGBDBM76191(1-(4-methyl-3-piperidin-1-ylsulfonyl-phenyl)-3-(ph...)
Affinity DataIC50: >1.00E+5nM. Assay description: Data Source: Sanford-Burnham Center for Chemical Genomics (SBCCG) Source Affiliation: Sanford-Burnham Medical Research Institute(SBMRI, San Diego, CA...
In DepthDetails PCBioAssay
TargetIntestinal-type alkaline phosphatase 1(Rattus norvegicus (Rat))
Burnham Center For Chemical Genomics
Curated by PubChem BioAssay
LigandPNGBDBM76191(1-(4-methyl-3-piperidin-1-ylsulfonyl-phenyl)-3-(ph...)
Affinity DataIC50:  1.40E+3nM. Assay description: Data Source: Sanford-Burnham Center for Chemical Genomics (SBCCG) Source Affiliation: Sanford-Burnham Medical Research Institute (SBMRI, San Diego, C...
In DepthDetails PCBioAssay
TargetAlkaline phosphatase, tissue-nonspecific isozyme(Homo sapiens (Human))
Burnham Center For Chemical Genomics
Curated by PubChem BioAssay
LigandPNGBDBM76191(1-(4-methyl-3-piperidin-1-ylsulfonyl-phenyl)-3-(ph...)
Affinity DataIC50: >1.00E+5nM. Assay description: Data Source: Sanford-Burnham Center for Chemical Genomics (SBCCG) Source Affiliation: Sanford-Burnham Medical Research Institute (SBMRI, San Diego, C...
In DepthDetails PCBioAssay
TargetAlkaline phosphatase, germ cell type(Homo sapiens (Human))
Burnham Center For Chemical Genomics
Curated by PubChem BioAssay
LigandPNGBDBM76191(1-(4-methyl-3-piperidin-1-ylsulfonyl-phenyl)-3-(ph...)
Affinity DataIC50: >1.00E+5nM. Assay description: Data Source: Sanford-Burnham Center for Chemical Genomics (SBCCG) Source Affiliation: Sanford-Burnham Medical Research Institute (SBMRI, San Diego, C...
In DepthDetails PCBioAssay