BDBM76215 CHEMBL1349252::MLS001096095::N-(3-cyanophenyl)-3-[(2-keto-3H-1,3-benzoxazol-6-yl)sulfonylamino]propionamide::N-(3-cyanophenyl)-3-[(2-oxidanylidene-3H-1,3-benzoxazol-6-yl)sulfonylamino]propanamide::N-(3-cyanophenyl)-3-[(2-oxo-3H-1,3-benzoxazol-6-yl)sulfonylamino]propanamide::SMR000631049::cid_24790981
SMILES O=C(CCNS(=O)(=O)c1ccc2[nH]c(=O)oc2c1)Nc1cccc(c1)C#N
InChI Key InChIKey=JXOGCQNWFZROAY-UHFFFAOYSA-N
Data  6 IC50  2 EC50
  Tab Delimited (TSV)   2D SDfile   Computed 3D by Vconf -m prep SDfile
Find this compound or compounds like it in BindingDB:
Activity Spreadsheet -- Enzyme Inhibition Constant Data from BindingDB
Found 8 hits for monomerid = 76215
TargetIntestinal-type alkaline phosphatase(Homo sapiens (Human))
Burnham Center For Chemical Genomics
Curated by PubChem BioAssay
LigandPNGBDBM76215(CHEMBL1349252 | MLS001096095 | N-(3-cyanophenyl)-3...)
Affinity DataIC50: >1.00E+5nM. Assay description: Data Source: Sanford-Burnham Center for Chemical Genomics (SBCCG) Source Affiliation: Sanford-Burnham Medical Research Institute(SBMRI, San Diego, CA...
In DepthDetails PCBioAssay
TargetAlkaline phosphatase, germ cell type(Homo sapiens (Human))
Burnham Center For Chemical Genomics
Curated by PubChem BioAssay
LigandPNGBDBM76215(CHEMBL1349252 | MLS001096095 | N-(3-cyanophenyl)-3...)
Affinity DataEC50:  8.97E+4nM. Assay description: Data Source: Sanford-Burnham Center for Chemical Genomics (SBCCG) Source Affiliation: Sanford-Burnham Medical Research Institute (SBMRI, San Diego, C...
In DepthDetails PCBioAssay
TargetAlkaline phosphatase, tissue-nonspecific isozyme(Homo sapiens (Human))
Burnham Center For Chemical Genomics
Curated by PubChem BioAssay
LigandPNGBDBM76215(CHEMBL1349252 | MLS001096095 | N-(3-cyanophenyl)-3...)
Affinity DataEC50: >1.00E+5nM. Assay description: Data Source: Sanford-Burnham Center for Chemical Genomics (SBCCG) Source Affiliation: Sanford-Burnham Medical Research Institute (SBMRI, San Diego, C...
In DepthDetails PCBioAssay
TargetIntestinal-type alkaline phosphatase(Mus musculus)
Sanford-Burnham Medical Research Institute
Curated by ChEMBL
LigandPNGBDBM76215(CHEMBL1349252 | MLS001096095 | N-(3-cyanophenyl)-3...)
Affinity DataIC50:  1.82E+3nM. Assay description: Inhibition of mouse duodenal-specific FLAG-tagged IAP expressed in African green monkey COS1 cells after 30 mins by chemiluminescence assay
In DepthDetails ArticlePubMed
TargetAlkaline phosphatase, placental type(Homo sapiens (Human))
Sanford-Burnham Medical Research Institute
Curated by ChEMBL
LigandPNGBDBM76215(CHEMBL1349252 | MLS001096095 | N-(3-cyanophenyl)-3...)
Affinity DataIC50: >1.00E+5nM. Assay description: Inhibition of FLAG-tagged PLAP (unknown origin) expressed in African green monkey COS1 cells after 30 mins by chemiluminescence assay
In DepthDetails ArticlePubMed
TargetAlkaline phosphatase, tissue-nonspecific isozyme(Homo sapiens (Human))
Burnham Center For Chemical Genomics
Curated by PubChem BioAssay
LigandPNGBDBM76215(CHEMBL1349252 | MLS001096095 | N-(3-cyanophenyl)-3...)
Affinity DataIC50: >1.00E+5nM. Assay description: Inhibition of FLAG-tagged TNAP (unknown origin) expressed in African green monkey COS1 cells after 30 mins by chemiluminescence assay
In DepthDetails ArticlePubMed
TargetIntestinal-type alkaline phosphatase(Homo sapiens (Human))
Burnham Center For Chemical Genomics
Curated by PubChem BioAssay
LigandPNGBDBM76215(CHEMBL1349252 | MLS001096095 | N-(3-cyanophenyl)-3...)
Affinity DataIC50: >1.00E+5nM. Assay description: Inhibition of human FLAG-tagged IAP expressed in African green monkey COS1 cells after 30 mins by chemiluminescence assay
In DepthDetails ArticlePubMed
TargetIntestinal-type alkaline phosphatase 1(Rattus norvegicus (Rat))
Burnham Center For Chemical Genomics
Curated by PubChem BioAssay
LigandPNGBDBM76215(CHEMBL1349252 | MLS001096095 | N-(3-cyanophenyl)-3...)
Affinity DataIC50:  2.17E+4nM. Assay description: Data Source: Sanford-Burnham Center for Chemical Genomics (SBCCG) Source Affiliation: Sanford-Burnham Medical Research Institute (SBMRI, San Diego, C...
In DepthDetails PCBioAssay