BDBM77498 5-(5-bromanylfuran-2-yl)-2,2-dimethyl-1,3,5,6-tetrahydrobenzo[a]phenanthridin-4-one::5-(5-bromo-2-furanyl)-2,2-dimethyl-1,3,5,6-tetrahydrobenzo[a]phenanthridin-4-one::5-(5-bromo-2-furyl)-2,2-dimethyl-1,3,5,6-tetrahydrobenzo[a]phenanthridin-4-one::5-(5-bromo-2-furyl)-2,2-dimethyl-2,3,5,6-tetrahydrobenzo[a]phenanthridin-4(1H)-one::5-(5-bromofuran-2-yl)-2,2-dimethyl-1,3,5,6-tetrahydrobenzo[a]phenanthridin-4-one::MLS000534730::SMR000142147::cid_2925038
SMILES CC1(C)CC(=O)C2=C(C1)c1c(NC2c2ccc(Br)o2)ccc2ccccc12
InChI Key InChIKey=RYYGQQKVEMFWTE-UHFFFAOYSA-N
Data  2 EC50
  Tab Delimited (TSV)   2D SDfile   Computed 3D by Vconf -m prep SDfile
Find this compound or compounds like it in BindingDB:
Activity Spreadsheet -- Enzyme Inhibition Constant Data from BindingDB
Found 2 hits for monomerid = 77498
TargetCaspase-3(Homo sapiens (Human))
The Scripps Research Institute Molecular Screening Center
Curated by PubChem BioAssay
LigandPNGBDBM77498(5-(5-bromanylfuran-2-yl)-2,2-dimethyl-1,3,5,6-tetr...)
Affinity DataEC50: >8.52E+4nM. Assay description: Source (MLPCN Center Name): The Scripps Research Institute Molecular Screening Center (SRIMSC) Affiliation: The Scripps Research Institute, TSR...
In DepthDetails PCBioAssay
TargetCaspase-7(Homo sapiens (Human))
The Scripps Research Institute Molecular Screening Center
Curated by PubChem BioAssay
LigandPNGBDBM77498(5-(5-bromanylfuran-2-yl)-2,2-dimethyl-1,3,5,6-tetr...)
Affinity DataEC50: >8.52E+4nM. Assay description: Source (MLPCN Center Name): The Scripps Research Institute Molecular Screening Center (SRIMSC) Affiliation: The Scripps Research Institute, TSR...
In DepthDetails PCBioAssay