BDBM77511 1-ethyl-6-fluoro-4-keto-7-thiomorpholino-quinoline-3-carboxylic acid ethyl ester::1-ethyl-6-fluoro-4-oxo-7-thiomorpholin-4-yl-3-quinolinecarboxylic acid ethyl ester::MLS000038775::SMR000034389::cid_660000::ethyl 1-ethyl-6-fluoranyl-4-oxidanylidene-7-thiomorpholin-4-yl-quinoline-3-carboxylate::ethyl 1-ethyl-6-fluoro-4-oxo-7-thiomorpholin-4-ylquinoline-3-carboxylate
SMILES CCOC(=O)c1cn(CC)c2cc(N3CCSCC3)c(F)cc2c1=O
InChI Key InChIKey=XADSQZGECRVVHC-UHFFFAOYSA-N
Data  1 IC50
  Tab Delimited (TSV)   2D SDfile   Computed 3D by Vconf -m prep SDfile
Find this compound or compounds like it in BindingDB:
Activity Spreadsheet -- Enzyme Inhibition Constant Data from BindingDB
Found 1 hit for monomerid = 77511
TargetRecBCD enzyme subunit RecD(Escherichia coli str. K-12 substr. MG1655)
The Scripps Research Institute Molecular Screening Center
Curated by PubChem BioAssay
LigandPNGBDBM77511(1-ethyl-6-fluoro-4-keto-7-thiomorpholino-quinoline...)
Affinity DataIC50: >1.19E+5nM. Assay description: Source (MLPCN Center Name): The Scripps Research Institute Molecular Screening Center (SRIMSC) Affiliation: The Scripps Research Institute, TSRI Assa...
In DepthDetails PCBioAssay