BDBM77861 2-(5-Phenyl-2,3-dihydro-[1,3,4]thiadiazol-2-yl)-phenol::2-(5-phenyl-2,3-dihydro-1,3,4-thiadiazol-2-yl)phenol::MLS001212798::SMR000517222::cid_2860190
SMILES Oc1ccccc1C1=NNC(S1)c1ccccc1
InChI Key InChIKey=UWXGQRGGUPVMRB-UHFFFAOYSA-N
Data  1 IC50
  Tab Delimited (TSV)   2D SDfile   Computed 3D by Vconf -m prep SDfile
Find this compound or compounds like it in BindingDB:
Activity Spreadsheet -- Enzyme Inhibition Constant Data from BindingDB
Found 1 hit for monomerid = 77861
TargetMitochondrial import inner membrane translocase subunit TIM10(Saccharomyces cerevisiae S288c)
Burnham Center For Chemical Genomics
Curated by PubChem BioAssay
LigandPNGBDBM77861(2-(5-Phenyl-2,3-dihydro-[1,3,4]thiadiazol-2-yl)-ph...)
Affinity DataIC50: >1.00E+5nM. Assay description: Data Source: Sanford-Burnham Center for Chemical Genomics (SBCCG) Source Affiliation: Sanford-Burnham Medical Research Institute(SBMRI, San Diego, CA...
In DepthDetails PCBioAssay