BDBM78060 2-[4-(2,8-dichloro-10,11-dihydrodibenzo[b,f]thiepin-10-yl)-1-piperazinyl]ethanol::2-[4-[3,8-bis(chloranyl)-5,6-dihydrobenzo[b][1]benzothiepin-5-yl]piperazin-1-yl]ethanol;cyclohexane::MLS000546776::SMR000113858::cid_9549646::cyclohexane;2-[4-(3,8-dichloro-5,6-dihydrobenzo[b][1]benzothiepin-5-yl)-1-piperazinyl]ethanol::cyclohexane;2-[4-(3,8-dichloro-5,6-dihydrobenzo[b][1]benzothiepin-5-yl)piperazin-1-yl]ethanol::cyclohexane;2-[4-(3,8-dichloro-5,6-dihydrobenzo[b][1]benzothiepin-5-yl)piperazino]ethanol
SMILES OCCN1CCN(CC1)C1Cc2cc(Cl)ccc2Sc2ccc(Cl)cc12
InChI Key InChIKey=RITAQUDKGCYTMA-UHFFFAOYSA-N
Data  1 IC50
  Tab Delimited (TSV)   2D SDfile   Computed 3D by Vconf -m prep SDfile
Find this compound or compounds like it in BindingDB:
Activity Spreadsheet -- Enzyme Inhibition Constant Data from BindingDB
Found 1 hit for monomerid = 78060
TargetMitochondrial import inner membrane translocase subunit TIM10(Saccharomyces cerevisiae S288c)
Burnham Center For Chemical Genomics
Curated by PubChem BioAssay
LigandPNGBDBM78060(2-[4-(2,8-dichloro-10,11-dihydrodibenzo[b,f]thiepi...)
Affinity DataIC50:  2.04E+4nM. Assay description: Data Source: Sanford-Burnham Center for Chemical Genomics (SBCCG) Source Affiliation: Sanford-Burnham Medical Research Institute(SBMRI, San Diego, CA...
In DepthDetails PCBioAssay