BDBM78862 1-benzyl-N-[3-(diethylamino)propyl]-2-hydroxy-4-keto-quinoline-3-carboxamide;hydrochloride::1-benzyl-N-[3-(diethylamino)propyl]-2-hydroxy-4-oxoquinoline-3-carboxamide;hydrochloride::MLS001073915::N-[3-(diethylamino)propyl]-2-hydroxy-4-oxo-1-(phenylmethyl)-3-quinolinecarboxamide;hydrochloride::N-[3-(diethylamino)propyl]-2-oxidanyl-4-oxidanylidene-1-(phenylmethyl)quinoline-3-carboxamide;hydrochloride::SMR000041351::cid_6602779
SMILES CCN(CC)CCCNC(=O)c1c(O)c2ccccc2n(Cc2ccccc2)c1=O
InChI Key InChIKey=VXMWLAVPVXEOKV-UHFFFAOYSA-N
Data  2 IC50  1 EC50
  Tab Delimited (TSV)   2D SDfile   Computed 3D by Vconf -m prep SDfile
Find this compound or compounds like it in BindingDB:
Activity Spreadsheet -- Enzyme Inhibition Constant Data from BindingDB
Found 3 hits for monomerid = 78862
TargetUbiquitin-conjugating enzyme E2 N(Homo sapiens (Human))
Burnham Center For Chemical Genomics
Curated by PubChem BioAssay
LigandPNGBDBM78862(1-benzyl-N-[3-(diethylamino)propyl]-2-hydroxy-4-ke...)
Affinity DataIC50: >2.00E+4nM. Assay description: Data Source: Sanford-Burnham Center for Chemical Genomics (SBCCG) Source Affiliation: Sanford-Burnham Medical Research Institute (SBMRI, San Diego CA...
In DepthDetails PCBioAssay
TargetHexokinase HKDC1 [W721R](Homo sapiens (Human))
Burnham Center For Chemical Genomics
Curated by PubChem BioAssay
LigandPNGBDBM78862(1-benzyl-N-[3-(diethylamino)propyl]-2-hydroxy-4-ke...)
Affinity DataIC50:  8.00E+4nM. Assay description: Data Source: Sanford-Burnham Center for Chemical Genomics (SBCCG) Source Affiliation: Sanford-Burnham Medical Research Institute (SBMRI, San Diego, C...
In DepthDetails PCBioAssay
TargetHexokinase HKDC1 [W721R](Homo sapiens (Human))
Burnham Center For Chemical Genomics
Curated by PubChem BioAssay
LigandPNGBDBM78862(1-benzyl-N-[3-(diethylamino)propyl]-2-hydroxy-4-ke...)
Affinity DataEC50: >8.00E+4nM. Assay description: Data Source: Sanford-Burnham Center for Chemical Genomics (SBCCG) Source Affiliation: Sanford-Burnham Medical Research Institute (SBMRI, San Diego, C...
In DepthDetails PCBioAssay