BDBM78993 MLS001199233::N-[3-[butyl(ethyl)amino]propyl]-5-ethyl-4-keto-thieno[3,2-c]quinoline-2-carboxamide::N-[3-[butyl(ethyl)amino]propyl]-5-ethyl-4-oxidanylidene-thieno[3,2-c]quinoline-2-carboxamide::N-[3-[butyl(ethyl)amino]propyl]-5-ethyl-4-oxo-2-thieno[3,2-c]quinolinecarboxamide::N-[3-[butyl(ethyl)amino]propyl]-5-ethyl-4-oxothieno[3,2-c]quinoline-2-carboxamide::N-{3-[butyl(ethyl)amino]propyl}-5-ethyl-4-oxo-4,5-dihydrothieno[3,2-c]quinoline-2-carboxamide::SMR000562887::cid_20865391
SMILES CCCCN(CC)CCCNC(=O)c1cc2c(s1)c1ccccc1n(CC)c2=O
InChI Key InChIKey=ZDJMLRLONVLBBO-UHFFFAOYSA-N
Data  1 IC50
  Tab Delimited (TSV)   2D SDfile   Computed 3D by Vconf -m prep SDfile
Find this compound or compounds like it in BindingDB:
Activity Spreadsheet -- Enzyme Inhibition Constant Data from BindingDB
Found 1 hit for monomerid = 78993
TargetUbiquitin-conjugating enzyme E2 N(Homo sapiens (Human))
Burnham Center For Chemical Genomics
Curated by PubChem BioAssay
LigandPNGBDBM78993(MLS001199233 | N-[3-[butyl(ethyl)amino]propyl]-5-e...)
Affinity DataIC50: >2.00E+4nM. Assay description: Data Source: Sanford-Burnham Center for Chemical Genomics (SBCCG) Source Affiliation: Sanford-Burnham Medical Research Institute (SBMRI, San Diego CA...
In DepthDetails PCBioAssay