BDBM79625 4,8-dimethyl-2-(1-pyrrolidinyl)quinoline;2,2,2-trifluoroacetic acid::4,8-dimethyl-2-pyrrolidin-1-yl-quinoline;2,2,2-tris(fluoranyl)ethanoic acid::4,8-dimethyl-2-pyrrolidin-1-ylquinoline;2,2,2-trifluoroacetic acid::4,8-dimethyl-2-pyrrolidino-quinoline;2,2,2-trifluoroacetic acid::VU0324893-2::cid_46891915
SMILES Cc1cccc2c(C)cc(nc12)N1CCCC1
InChI Key InChIKey=JFXGOELTARHIOR-UHFFFAOYSA-N
Data  1 IC50
  Tab Delimited (TSV)   2D SDfile   Computed 3D by Vconf -m prep SDfile
Find this compound or compounds like it in BindingDB:
Activity Spreadsheet -- Enzyme Inhibition Constant Data from BindingDB
Found 1 hit for monomerid = 79625
TargetShort transient receptor potential channel 4(Mus musculus)
Johns Hopkins Ion Channel Center
Curated by PubChem BioAssay
LigandPNGBDBM79625(4,8-dimethyl-2-(1-pyrrolidinyl)quinoline;2,2,2-tri...)
Affinity DataIC50:  9.96E+3nM. Assay description: The inhibitory effects of test compounds on TRPC4 channels were evaluated in electrophysiological assays using a QPatch16 automated electrophysiology...
In DepthDetails PCBioAssay