BDBM7975 (3S,4S)-N-[(1S)-1-{[(1S)-1-carbamoyl-3-methylbutyl]carbamoyl}ethyl]-3-hydroxy-4-[(2S)-3-methyl-2-(pyridin-2-ylformamido)butanamido]-6-phenylhexanamide::Pyridine-2-carboxylic Acid ((S)-1-{(1S,2S)-3-[(S)-1-((S)-1-Carbamoyl-3-methylbutylcarbamoyl)ethylcarbamoyl]-2-hydroxy-1-phenethylpropylcarbamoyl}-2-methylpropyl)amide::Statine-like inhibitor 14
SMILES CC(C)C[C@H](NC(=O)[C@H](C)NC(=O)C[C@H](O)[C@H](CCc1ccccc1)NC(=O)[C@@H](NC(=O)c1ccccn1)C(C)C)C(N)=O
InChI Key InChIKey=HAHQMOHZXMDXSL-PPMAGOSRSA-N
Data  3 KI
  Tab Delimited (TSV)   2D SDfile   Computed 3D by Vconf -m prep SDfile
Find this compound or compounds like it in BindingDB:
Activity Spreadsheet -- Enzyme Inhibition Constant Data from BindingDB
Found 3 hits for monomerid = 7975
TargetPlasmepsin I(Plasmodium falciparum)
Linkoping University
LigandPNGBDBM7975((3S,4S)-N-[(1S)-1-{[(1S)-1-carbamoyl-3-methylbutyl...)
Affinity DataKi:  27nM. Assay description: Enzyme activities were assayed by monitoring the hydrolysis of substrate in the presence or absence of inhibitor compounds. The hydrolysis was record...
In DepthDetails ArticlePubMed
TargetPlasmepsin II(Plasmodium falciparum)
Linkoping University
LigandPNGBDBM7975((3S,4S)-N-[(1S)-1-{[(1S)-1-carbamoyl-3-methylbutyl...)
Affinity DataKi:  46nM ΔG°:  -9.90kcal/molepH: 4.5 T: 2°C. Assay description: Enzyme activities were assayed by monitoring the hydrolysis of substrate in the presence or absence of inhibitor compounds. The hydrolysis was record...
In DepthDetails ArticlePubMed
TargetCathepsin D(Homo sapiens (Human))
Linkoping University
LigandPNGBDBM7975((3S,4S)-N-[(1S)-1-{[(1S)-1-carbamoyl-3-methylbutyl...)
Affinity DataKi:  980nM. Assay description: Enzyme activities were assayed by monitoring the hydrolysis of substrate in the presence or absence of inhibitor compounds. The hydrolysis was record...
In DepthDetails ArticlePubMed