BDBM7986 (3S,4S)-5-[(4-bromophenyl)methoxy]-N-[(1S)-1-{[(1S)-1-carbamoyl-3-methylbutyl]carbamoyl}ethyl]-3-hydroxy-4-[(2R)-3-methyl-2-(pyridin-2-ylformamido)butanamido]pentanamide::Pyridine-2-carboxylic Acid ((R)-1-{(1S,2S)-1-(4-Bromobenzyloxymethyl)-3-[(S)-1-((S)-1-carbamoyl-3-methylbutylcarbamoyl)ethylcarbamoyl]-2-hydroxypropylcarbamoyl}-2-methylpropyl)amide::Statine-like inhibitor 25
SMILES CC(C)C[C@H](NC(=O)[C@H](C)NC(=O)C[C@H](O)[C@H](COCc1ccc(Br)cc1)NC(=O)[C@H](NC(=O)c1ccccn1)C(C)C)C(N)=O
InChI Key InChIKey=QXHNYZQKWOKULQ-FVHDNLHISA-N
Data  3 KI
  Tab Delimited (TSV)   2D SDfile   Computed 3D by Vconf -m prep SDfile
Find this compound or compounds like it in BindingDB:
Activity Spreadsheet -- Enzyme Inhibition Constant Data from BindingDB
Found 3 hits for monomerid = 7986
TargetPlasmepsin I(Plasmodium falciparum)
Linkoping University
LigandPNGBDBM7986((3S,4S)-5-[(4-bromophenyl)methoxy]-N-[(1S)-1-{[(1S...)
Affinity DataKi:  6.40nM. Assay description: Enzyme activities were assayed by monitoring the hydrolysis of substrate in the presence or absence of inhibitor compounds. The hydrolysis was record...
In DepthDetails ArticlePubMed
TargetPlasmepsin II(Plasmodium falciparum)
Linkoping University
LigandPNGBDBM7986((3S,4S)-5-[(4-bromophenyl)methoxy]-N-[(1S)-1-{[(1S...)
Affinity DataKi:  15nM ΔG°:  -10.6kcal/molepH: 4.5 T: 2°C. Assay description: Enzyme activities were assayed by monitoring the hydrolysis of substrate in the presence or absence of inhibitor compounds. The hydrolysis was record...
In DepthDetails ArticlePubMed
TargetCathepsin D(Homo sapiens (Human))
Linkoping University
LigandPNGBDBM7986((3S,4S)-5-[(4-bromophenyl)methoxy]-N-[(1S)-1-{[(1S...)
Affinity DataKi:  41nM. Assay description: Enzyme activities were assayed by monitoring the hydrolysis of substrate in the presence or absence of inhibitor compounds. The hydrolysis was record...
In DepthDetails ArticlePubMed