BDBM7993 (3S,4S)-5-[(4-bromophenyl)methoxy]-N-[(1S)-1-{[(1S)-1-carbamoyl-3-methylbutyl]carbamoyl}ethyl]-4-[(2S)-2,3-dihydro-1H-indol-2-ylformamido]-3-hydroxypentanamide::(S)-2,3-Dihydro-1H-indole-2-carboxylic Acid {(1S,2S)-1-(4-Bromobenzyloxymethyl)-3-[(S)-1-((S)-1-carbamoyl-3-methylbutylcarbamoyl)ethylcarbamoyl]-2-hydroxypropyl}amide::Statine-like inhibitor 32
SMILES CC(C)C[C@H](NC(=O)[C@H](C)NC(=O)C[C@H](O)[C@H](COCc1ccc(Br)cc1)NC(=O)[C@@H]1Cc2ccccc2N1)C(N)=O
InChI Key InChIKey=BTSSBMGYUFYJPI-UXXDJHJKSA-N
Data  3 KI
  Tab Delimited (TSV)   2D SDfile   Computed 3D by Vconf -m prep SDfile
Find this compound or compounds like it in BindingDB:
Activity Spreadsheet -- Enzyme Inhibition Constant Data from BindingDB
Found 3 hits for monomerid = 7993
TargetPlasmepsin I(Plasmodium falciparum)
Linkoping University
LigandPNGBDBM7993((3S,4S)-5-[(4-bromophenyl)methoxy]-N-[(1S)-1-{[(1S...)
Affinity DataKi:  59nM. Assay description: Enzyme activities were assayed by monitoring the hydrolysis of substrate in the presence or absence of inhibitor compounds. The hydrolysis was record...
Ligand InfoPC cidPC sid
In DepthDetails ArticlePubMed
TargetPlasmepsin II(Plasmodium falciparum)
Linkoping University
LigandPNGBDBM7993((3S,4S)-5-[(4-bromophenyl)methoxy]-N-[(1S)-1-{[(1S...)
Affinity DataKi:  144nM. Assay description: Enzyme activities were assayed by monitoring the hydrolysis of substrate in the presence or absence of inhibitor compounds. The hydrolysis was record...
Ligand InfoPC cidPC sid
In DepthDetails ArticlePubMed
TargetCathepsin D(Homo sapiens (Human))
Linkoping University
LigandPNGBDBM7993((3S,4S)-5-[(4-bromophenyl)methoxy]-N-[(1S)-1-{[(1S...)
Affinity DataKi:  322nM. Assay description: Enzyme activities were assayed by monitoring the hydrolysis of substrate in the presence or absence of inhibitor compounds. The hydrolysis was record...
Ligand InfoPC cidPC sid
In DepthDetails ArticlePubMed