BDBM80123 2-furanyl-(4,4,8-trimethyl-1-sulfanylidene-5-dithiolo[3,4-c]quinolinyl)methanone::2-furyl-(4,4,8-trimethyl-1-thioxo-dithiolo[3,4-c]quinolin-5-yl)methanone::Furan-2-yl-(4,4,8-trimethyl-1-thioxo-1,4-dihydro-2,3-dithia-5-aza-cyclopenta[a]naphthalen-5-yl)-methanone::MLS000525939::SMR000116413::cid_1116028::furan-2-yl-(4,4,8-trimethyl-1-sulfanylidene-[1,2]dithiolo[3,4-c]quinolin-5-yl)methanone::furan-2-yl-(4,4,8-trimethyl-1-sulfanylidenedithiolo[3,4-c]quinolin-5-yl)methanone
SMILES Cc1ccc2N(C(=O)c3ccco3)C(C)(C)c3ssc(=S)c3-c2c1
InChI Key InChIKey=NEVVRUDKXFSGJC-UHFFFAOYSA-N
Data  1 IC50
  Tab Delimited (TSV)   2D SDfile   Computed 3D by Vconf -m prep SDfile
Find this compound or compounds like it in BindingDB:
Activity Spreadsheet -- Enzyme Inhibition Constant Data from BindingDB
Found 1 hit for monomerid = 80123
TargetDNA dC->dU-editing enzyme APOBEC-3G(Homo sapiens (Human))
Burnham Center For Chemical Genomics
Curated by PubChem BioAssay
LigandPNGBDBM80123(2-furanyl-(4,4,8-trimethyl-1-sulfanylidene-5-dithi...)
Affinity DataIC50: >1.00E+5nMT: 2°C. Assay description: Data Source: Sanford-Burnham Center for Chemical Genomics (SBCCG) Source Affiliation: Sanford-Burnham Medical Research Institute (SBMRI, San Diego, C...
In DepthDetails PCBioAssay