BDBM8049 2-Anilino-4-(thiazol-5-yl)pyrimidine deriv. 20::4-(2,4-dimethyl-1,3-thiazol-5-yl)-N-[4-(trifluoromethyl)phenyl]pyrimidin-2-amine::4-(dimethyl-1,3-thiazol-5-yl)-N-[4-(trifluoromethyl)phenyl]pyrimidin-2-amine, 2::[4-(2,4-Dimethylthiazol-5-yl)pyrimidin-2-yl]-(4-trifluoromethylphenyl)amine
SMILES Cc1nc(C)c(s1)-c1ccnc(Nc2ccc(cc2)C(F)(F)F)n1
InChI Key InChIKey=MEZFDQUDLQCVNX-UHFFFAOYSA-N
Data  2 KI  2 IC50
PDB links: 2 PDB IDs match this monomer.
  Tab Delimited (TSV)   2D SDfile   Computed 3D by Vconf -m prep SDfile
Find this compound or compounds like it in BindingDB:
Activity Spreadsheet -- Enzyme Inhibition Constant Data from BindingDB
Found 4 hits for monomerid = 8049
TargetCyclin-dependent kinase 2/G1/S-specific cyclin-E1(Homo sapiens (Human))
Cyclacel
LigandPNGBDBM8049(2-Anilino-4-(thiazol-5-yl)pyrimidine deriv. 20 | 4...)
Affinity DataKi:  290nM ΔG°:  -9.06kcal/molepH: 7.4 T: 2°C. Assay description: In vitro kinase assay using purified enzyme, was incubated at 30 °C with substrate, and test compounds in the presence of 100 uM ATP/ [gamma-32P...
TargetCyclin-dependent kinase 4/G1/S-specific cyclin-D1(Homo sapiens (Human))
Cyclacel
LigandPNGBDBM8049(2-Anilino-4-(thiazol-5-yl)pyrimidine deriv. 20 | 4...)
Affinity DataKi: >2.00E+4nM ΔG°: >-6.51kcal/moleT: 2°C. Assay description: In vitro kinase assay using purified enzyme, was incubated at 30 °C with substrate, and test compounds in the presence of 100 uM ATP/ [gamma-32P...
In DepthDetails ArticlePubMed
TargetCyclin-dependent kinase 2(Homo sapiens (Human))
Cyclacel
LigandPNGBDBM8049(2-Anilino-4-(thiazol-5-yl)pyrimidine deriv. 20 | 4...)
Affinity DataIC50:  290nM. Assay description: In vitro inhibition assay using human recombinant CDK2 and human recombinant cyclin A2.
TargetCyclin-A2/Cyclin-dependent kinase 2(Homo sapiens (Human))
Cyclacel
LigandPNGBDBM8049(2-Anilino-4-(thiazol-5-yl)pyrimidine deriv. 20 | 4...)
Affinity DataIC50:  290nM. Assay description: In vitro inhibition assay using human recombinant CDK2 and human recombinant cyclin A2.