BDBM80664 (4R,5R,6R)-1-ethyl-2-(2-methoxyethylamino)-6-methyl-4-phenyl-5,6-dihydro-4H-pyrimidine-5-carboxylic acid methyl ester::MLS000829797::SMR000671991::cid_24871332::methyl (4R,5R,6R)-1-ethyl-2-(2-methoxyethylamino)-6-methyl-4-phenyl-5,6-dihydro-4H-pyrimidine-5-carboxylate
SMILES CCN1[C@H](C)[C@H]([C@@H](N=C1NCCOC)c1ccccc1)C(=O)OC
InChI Key InChIKey=XABZTVRZBZFTFX-BMFZPTHFSA-N
Data  2 IC50
  Tab Delimited (TSV)   2D SDfile   Computed 3D by Vconf -m prep SDfile
Find this compound or compounds like it in BindingDB:
Activity Spreadsheet -- Enzyme Inhibition Constant Data from BindingDB
Found 2 hits for monomerid = 80664
TargetDNA dC->dU-editing enzyme APOBEC-3G(Homo sapiens (Human))
Burnham Center For Chemical Genomics
Curated by PubChem BioAssay
LigandPNGBDBM80664((4R,5R,6R)-1-ethyl-2-(2-methoxyethylamino)-6-methy...)
Affinity DataIC50:  4.28E+3nMT: 2°C. Assay description: Data Source: Sanford-Burnham Center for Chemical Genomics (SBCCG) Source Affiliation: Sanford-Burnham Medical Research Institute (SBMRI, San Diego, C...
In DepthDetails PCBioAssay
TargetDNA dC->dU-editing enzyme APOBEC-3A(Homo sapiens (Human))
Burnham Center For Chemical Genomics
Curated by PubChem BioAssay
LigandPNGBDBM80664((4R,5R,6R)-1-ethyl-2-(2-methoxyethylamino)-6-methy...)
Affinity DataIC50:  4.47E+3nMT: 2°C. Assay description: Data Source: Sanford-Burnham Center for Chemical Genomics (SBCCG) Source Affiliation: Sanford-Burnham Medical Research Institute (SBMRI, San Diego, C...
In DepthDetails PCBioAssay