BDBM80792 4-methyl-N'-[(E)-(2-oxidanyl-4-oxidanylidene-cyclohexa-2,5-dien-1-ylidene)methyl]-1,2,5-oxadiazole-3-carbohydrazide::MLS000703560::N'-[(E)-(2-hydroxy-4-keto-cyclohexa-2,5-dien-1-ylidene)methyl]-4-methyl-furazan-3-carbohydrazide::N'-[(E)-(2-hydroxy-4-oxo-1-cyclohexa-2,5-dienylidene)methyl]-4-methyl-1,2,5-oxadiazole-3-carbohydrazide::N'-[(E)-(2-hydroxy-4-oxocyclohexa-2,5-dien-1-ylidene)methyl]-4-methyl-1,2,5-oxadiazole-3-carbohydrazide::SMR000273925::cid_5401098
SMILES Cc1nonc1C(=O)NN=Cc1ccc(O)cc1O
InChI Key InChIKey=GMIDDARPXCZOLE-UHFFFAOYSA-N
Data  2 EC50
  Tab Delimited (TSV)   2D SDfile   Computed 3D by Vconf -m prep SDfile
Find this compound or compounds like it in BindingDB:
Activity Spreadsheet -- Enzyme Inhibition Constant Data from BindingDB
Found 2 hits for monomerid = 80792
TargetHexokinase-1(Homo sapiens (Human))
Burnham Center For Chemical Genomics
Curated by PubChem BioAssay
LigandPNGBDBM80792(4-methyl-N'-[(E)-(2-oxidanyl-4-oxidanylidene-cyclo...)
Affinity DataEC50: >8.00E+4nM. Assay description: Data Source: Sanford-Burnham Center for Chemical Genomics (SBCCG) Source Affiliation: Sanford-Burnham Medical Research Institute (SBMRI, San Diego, C...
In DepthDetails PCBioAssay
TargetHexokinase HKDC1 [W721R](Homo sapiens (Human))
Burnham Center For Chemical Genomics
Curated by PubChem BioAssay
LigandPNGBDBM80792(4-methyl-N'-[(E)-(2-oxidanyl-4-oxidanylidene-cyclo...)
Affinity DataEC50: >8.00E+4nM. Assay description: Data Source: Sanford-Burnham Center for Chemical Genomics (SBCCG) Source Affiliation: Sanford-Burnham Medical Research Institute (SBMRI, San Diego, C...
In DepthDetails PCBioAssay