BDBM81476 CAS_124355::NSC_124355::trans-3-aminocyclopentane-1-carboxylic acid,(+/-)
SMILES NC1CCC(C1)C(O)=O
InChI Key InChIKey=MLLSSTJTARJLHK-UHFFFAOYSA-N
Data  1 KI
  Tab Delimited (TSV)   2D SDfile   Computed 3D by Vconf -m prep SDfile
Find this compound or compounds like it in BindingDB:
Activity Spreadsheet -- Enzyme Inhibition Constant Data from BindingDB
Found 1 hit for monomerid = 81476
TargetGamma-aminobutyric acid type B receptor subunit 1(Rattus norvegicus (Rat))
TBA
Curated by PDSP Ki Database
LigandPNGBDBM81476(CAS_124355 | NSC_124355 | trans-3-aminocyclopentan...)
Affinity DataKi:  266nM
In DepthDetails ArticlePubMed