BDBM81495 YM796(-)
SMILES C[C@@H]1OC2(CC1=C)CCN(C)CC2
InChI Key InChIKey=HDTOQYUZMCNTBZ-JTQLQIEISA-N
Data  2 KI
  Tab Delimited (TSV)   2D SDfile   Computed 3D by Vconf -m prep SDfile
Find this compound or compounds like it in BindingDB:
Activity Spreadsheet -- Enzyme Inhibition Constant Data from BindingDB
Found 2 hits for monomerid = 81495
TargetMuscarinic acetylcholine receptor M2(RAT)
University Of Arizona
Curated by PDSP Ki Database
LigandPNGBDBM81495(YM796(-))
Affinity DataKi: >1.00E+4nM
In DepthDetails ArticlePubMed
TargetMuscarinic acetylcholine receptor M1(RAT)
University Of Arizona
Curated by PDSP Ki Database
LigandPNGBDBM81495(YM796(-))
Affinity DataKi: >1.00E+4nM
In DepthDetails ArticlePubMed