BDBM81522 CGS 23130
SMILES COc1ccc(\C=C\CCCCOc2ccc(Oc3cccc(c3)C(O)=O)cc2CCC(O)=O)cc1
InChI Key InChIKey=MKNFGCCNPFRCMQ-QPJJXVBHSA-N
Data  2 KI
  Tab Delimited (TSV)   2D SDfile   Computed 3D by Vconf -m prep SDfile
Find this compound or compounds like it in BindingDB:
Activity Spreadsheet -- Enzyme Inhibition Constant Data from BindingDB
Found 2 hits for monomerid = 81522
TargetLeukotriene B4 receptor 2(Homo sapiens (Human))
Ciba-Geigy
Curated by PDSP Ki Database
LigandPNGBDBM81522(CGS 23130)
Ligand InfoPC cidPC sid
In DepthDetails PubMed
TargetLeukotriene B4 receptor 2(Homo sapiens (Human))
Ciba-Geigy
Curated by PDSP Ki Database
LigandPNGBDBM81522(CGS 23130)
Affinity DataKi:  24nM
Ligand InfoPC cidPC sid
In DepthDetails PubMed