BDBM81680 IDV
SMILES CC(=N[C@@H]1[C@H](O)Cc2ccccc12)[C@H](C[C@H](O)CN1CCN(Cc2cccnc2)C[C@H]1C(=O)NC(C)(C)C)Cc1ccccc1
InChI Key InChIKey=ZZZPCZNJLJHHEX-MCVPMOIPSA-N
Data  1 KI
  Tab Delimited (TSV)   2D SDfile   Computed 3D by Vconf -m prep SDfile
Find this compound or compounds like it in BindingDB:
Activity Spreadsheet -- Enzyme Inhibition Constant Data from BindingDB
Found 1 hit for monomerid = 81680
TargetHIV-1 protease(Human immunodeficiency virus)
University Of Maryland
LigandPNGBDBM81680(IDV)
Affinity DataKi:  0.180nM. Assay description: Inhibition assay using HIV protease and Sulfonamide compounds.
In DepthDetails ArticlePubMed