BDBM82280 PYY3-36, human
SMILES CCC(C)[C@H](N)C(=O)N[C@@H](CCCCN)C(=O)N1CCC[C@H]1C(=O)N[C@@H](CCC(O)=O)C(=O)N[C@@H](C)C(=O)N1CCC[C@H]1C(=O)NCC(=O)N[C@@H](CCC(O)=O)C(=O)N[C@@H](CC(O)=O)C(=O)N[C@@H](C)C(=O)N[C@@H](CO)C(=O)N1CCC[C@H]1C(=O)N[C@@H](CCC(O)=O)C(=O)N[C@@H](CCC(O)=O)C(=O)N[C@@H](CC(C)C)C(=O)N[C@@H](CC(N)=O)C(=O)N[C@@H](CCCN=C(N)N)C(=O)N[C@@H](Cc1ccc(O)cc1)C(=O)N[C@@H](Cc1ccc(O)cc1)C(=O)N[C@@H](C)C(=O)N[C@@H](CO)C(=O)N[C@@H](CC(C)C)C(=O)N[C@@H](CCCN=C(N)N)C(=O)N[C@@H](Cc1c[nH]cn1)C(=O)N[C@@H](Cc1ccc(O)cc1)C(=O)N[C@@H](CC(C)C)C(=O)N[C@@H](CC(N)=O)C(=O)N[C@@H](CC(C)C)C(=O)N[C@@H](C(C)C)C(=O)N[C@@H]([C@@H](C)O)C(=O)N[C@@H](CCCN=C(N)N)C(=O)N[C@@H](CCC(N)=O)C(=O)N[C@@H](CCCN=C(N)N)C(=O)N[C@@H](Cc1ccc(O)cc1)C(O)=O
InChI Key InChIKey=IOMOHWHQDZJDAB-JEZQYTJSSA-N
Data  6 KI
  Tab Delimited (TSV)   2D SDfile   Computed 3D by Vconf -m prep SDfile
Find this compound or compounds like it in BindingDB:
Activity Spreadsheet -- Enzyme Inhibition Constant Data from BindingDB
Found 6 hits for monomerid = 82280
TargetNeuropeptide Y receptor type 2(Homo sapiens (Human))
Synaptic Pharmaceutical
Curated by PDSP Ki Database
LigandPNGBDBM82280(PYY3-36, human)
Affinity DataKi:  0.670nM
In DepthDetails ArticlePubMed
TargetNeuropeptide Y receptor type 2(Homo sapiens (Human))
Synaptic Pharmaceutical
Curated by PDSP Ki Database
LigandPNGBDBM82280(PYY3-36, human)
Affinity DataKi:  0.680nM
In DepthDetails PubMed
TargetNeuropeptide Y receptor type 4(Homo sapiens (Human))
Synaptic Pharmaceutical
Curated by PDSP Ki Database
LigandPNGBDBM82280(PYY3-36, human)
Affinity DataKi:  14nM
In DepthDetails ArticlePubMed
TargetNeuropeptide Y receptor type 1(Homo sapiens (Human))
Synaptic Pharmaceutical
Curated by PDSP Ki Database
LigandPNGBDBM82280(PYY3-36, human)
Affinity DataKi:  45.7nM
In DepthDetails ArticlePubMed
TargetNeuropeptide Y receptor type 1(Homo sapiens (Human))
Synaptic Pharmaceutical
Curated by PDSP Ki Database
LigandPNGBDBM82280(PYY3-36, human)
Affinity DataKi:  45.7nM
In DepthDetails PubMed
TargetNeuropeptide Y receptor type 1(Homo sapiens (Human))
Synaptic Pharmaceutical
Curated by PDSP Ki Database
LigandPNGBDBM82280(PYY3-36, human)
Affinity DataKi:  45.7nM
In DepthDetails ArticlePubMed