BDBM84409 4-bromo-N-phenazin-2-yl-benzamide::cid_3273794
SMILES Brc1ccc(cc1)C(=O)Nc1ccc2nc3ccccc3nc2c1
InChI Key InChIKey=UFWHQAPYEZNGQU-UHFFFAOYSA-N
Data  1 IC50
  Tab Delimited (TSV)   2D SDfile   Computed 3D by Vconf -m prep SDfile
Find this compound or compounds like it in BindingDB:
Activity Spreadsheet -- Enzyme Inhibition Constant Data from BindingDB
Found 1 hit for monomerid = 84409
TargetSUMO-conjugating enzyme UBC9(Homo sapiens (Human))
Burnham Center For Chemical Genomics
Curated by PubChem BioAssay
LigandPNGBDBM84409(4-bromo-N-phenazin-2-yl-benzamide | cid_3273794)
Affinity DataIC50:  2.67E+4nM. Assay description: Data Source: Sanford-Burnham Center for Chemical Genomics (SBCCG) Source Affiliation: Sanford-Burnham Medical Research Institute (SBMRI, San Diego, C...
In DepthDetails PCBioAssay