BDBM8482 (2R)-N-hydroxy-3-methyl-2-[(2-phenylethane)sulfonamido]butanamide::hydroxamate analogue 19
SMILES CC(C)[C@@H](NS(=O)(=O)CCc1ccccc1)C(=O)NO
InChI Key InChIKey=NTGRIGCAFDWJFQ-GFCCVEGCSA-N
Data  1 IC50
  Tab Delimited (TSV)   2D SDfile   Computed 3D by Vconf -m prep SDfile
Find this compound or compounds like it in BindingDB:
Activity Spreadsheet -- Enzyme Inhibition Constant Data from BindingDB
Found 1 hit for monomerid = 8482
TargetLethal factor(Bacillus anthracis)
Merck Research Laboratories
LigandPNGBDBM8482((2R)-N-hydroxy-3-methyl-2-[(2-phenylethane)sulfona...)
Affinity DataIC50:  1.19E+4nM. Assay description: The assay was performed in a 96-well plate, each well contained substrate peptide, LF, and the test compound. The C-terminally fluorophore of substra...
Ligand InfoPC cidPC sid
In DepthDetails ArticlePubMed