BDBM84879 THC, 5'-F3
SMILES CC1=C[C@@H]2[C@@H](CC1)C(C)(C)Oc1cc(CCCCC(F)(F)F)cc(O)c21
InChI Key InChIKey=HYLCCTSXTJQKBY-HZPDHXFCSA-N
Data  1 KI
  Tab Delimited (TSV)   2D SDfile   Computed 3D by Vconf -m prep SDfile
Find this compound or compounds like it in BindingDB:
Activity Spreadsheet -- Enzyme Inhibition Constant Data from BindingDB
Found 1 hit for monomerid = 84879
TargetCannabinoid receptor 1(Rattus norvegicus (rat))
Virginia Commonwealth University
Curated by PDSP Ki Database
LigandPNGBDBM84879(THC, 5'-F3)
Affinity DataKi:  19.9nM
In DepthDetails PubMed