BDBM85193 Ac-RYYKWR-NH2
SMILES CC(=O)N[C@@H](CCCNC(N)=N)C(=O)N[C@@H](Cc1ccc(O)cc1)C(=O)N[C@@H](Cc1ccc(O)cc1)C(=O)N[C@@H](CCCCN)C(=O)N[C@@H](Cc1c[nH]c2ccccc12)C(=O)N[C@@H](CCCN=C(N)N)C(N)=O
InChI Key InChIKey=ADOLSNWCTANCOT-SKGSPYGFSA-N
Data  1 KI
  Tab Delimited (TSV)   2D SDfile   Computed 3D by Vconf -m prep SDfile
Find this compound or compounds like it in BindingDB:
Activity Spreadsheet -- Enzyme Inhibition Constant Data from BindingDB
Found 1 hit for monomerid = 85193
TargetNociceptin receptor(MOUSE)
Torrey Pines Institute For Molecular Studies
Curated by PDSP Ki Database
LigandPNGBDBM85193(Ac-RYYKWR-NH2)
Affinity DataKi:  1.47nM
In DepthDetails PubMed