BDBM85678 NPY [Ala31, Aib32], porcine
SMILES CCC(C)[C@H](NC(=O)N(Cc1ccc(O)cc1)NC(=O)[C@H](Cc1c[nH]cn1)NC(=O)[C@H](CCCNC(N)=[NH2+])NC(=O)[C@H](CC(C)C)NC(=O)[C@H](C)NC(=O)[C@H](CO)NC(=O)[C@H](Cc1ccc(O)cc1)NC(=O)[C@H](Cc1ccc(O)cc1)NC(=O)[C@H](CCCNC(N)=N)NC(=O)[C@H](C)NC(=O)[C@H](CC(C)C)NC(=O)[C@H](CC(O)=O)NC(=O)[C@H](CCC(O)=O)NC(=O)[C@H](C)NC(=O)[C@@H]1CCCN1C(=O)[C@H](C)NC(=O)[C@H](CC(O)=O)NC(=O)[C@H](CCC(O)=O)NC(=O)CNC(=O)[C@@H]1CCCN1C(=O)[C@H](CC(N)=O)NC(=O)[C@H](CC(O)=O)NC(=O)[C@@H]1CCCN1C(=O)[C@H](CCCCN)NC(=O)[C@H](CO)NC(=O)[C@@H]1CCCN1C(=O)C(N)Cc1ccc(O)cc1)C(=O)N[C@@H](CC(N)=O)C(=O)N[C@@H](CC(C)C)C(=O)N[C@@H](C)C(=O)NC(C)(C)C(=O)N[C@@H](CCCNC(N)=N)C(=O)N[C@@H](CCC(N)=O)C(=O)N[C@@H](CCCNC(N)=N)C(=O)N[C@@H](Cc1ccc(O)cc1)C(N)=O
InChI Key InChIKey=DOIDQOQZIFEXIR-KEHCQVFISA-O
Data  4 KI
  Tab Delimited (TSV)   2D SDfile   Computed 3D by Vconf -m prep SDfile
Find this compound or compounds like it in BindingDB:
Activity Spreadsheet -- Enzyme Inhibition Constant Data from BindingDB
Found 4 hits for monomerid = 85678
TargetNeuropeptide Y receptor type 5(Homo sapiens (Human))
Federal Institute Of Technology Of Zurich
Curated by PDSP Ki Database
LigandPNGBDBM85678(NPY [Ala31, Aib32], porcine)
In DepthDetails ArticlePubMed
TargetNeuropeptide Y receptor type 2(Homo sapiens (Human))
Federal Institute Of Technology Of Zurich
Curated by PDSP Ki Database
LigandPNGBDBM85678(NPY [Ala31, Aib32], porcine)
Affinity DataKi:  500nM
In DepthDetails ArticlePubMed
TargetNeuropeptide Y receptor type 1(Homo sapiens (Human))
Federal Institute Of Technology Of Zurich
Curated by PDSP Ki Database
LigandPNGBDBM85678(NPY [Ala31, Aib32], porcine)
Affinity DataKi:  700nM
In DepthDetails ArticlePubMed
TargetNeuropeptide Y receptor type 4(Homo sapiens (Human))
Federal Institute Of Technology Of Zurich
Curated by PDSP Ki Database
LigandPNGBDBM85678(NPY [Ala31, Aib32], porcine)
Affinity DataKi:  1.00E+3nM
In DepthDetails ArticlePubMed