BDBM85839 [Pro34,Phe35]h alpha-CGRP27-37
SMILES [H][N]1([#6]-[#6]-[#6]-[#6@H]1-[#6](=O)-[#7]-[#6@@H](-[#6]-c1ccccc1)-[#6](=O)-[#7]-[#6@@H](-[#6])-[#6](=O)-[#7]-[#6@@H](-[#6]-c1ccccc1)-[#6](-[#7])=O)[#6](=O)-[#6]-[#7]-[#6](=O)-[#6@@H](-[#7]-[#6](=O)-[#6@H](-[#6]-[#6](-[#7])=O)-[#7]-[#6](=O)-[#6@@H](-[#7]-[#6](=O)-[#6@@H]-1-[#6]-[#6]-[#6]-[#7]-1)-[#6@@H](-[#6])-[#8])-[#6](-[#6])-[#6]
InChI Key InChIKey=SUXQHYWYWVDTBR-LFCJLEJMSA-N
Data  2 KI
  Tab Delimited (TSV)   2D SDfile   Computed 3D by Vconf -m prep SDfile
Find this compound or compounds like it in BindingDB:
Activity Spreadsheet -- Enzyme Inhibition Constant Data from BindingDB
Found 2 hits for monomerid = 85839
TargetCalcitonin gene-related peptide type 1 receptor(PIG)
Creighton University
Curated by PDSP Ki Database
LigandPNGBDBM85839([Pro34,Phe35]h alpha-CGRP27-37)
Affinity DataKi:  50.7nM
In DepthDetails PubMed
TargetReceptor activity-modifying protein 1(PIG)
Creighton University
Curated by PDSP Ki Database
LigandPNGBDBM85839([Pro34,Phe35]h alpha-CGRP27-37)
Affinity DataKi:  118nM
In DepthDetails PubMed