BDBM85945 des(Ac-Arg6),Ava14,15::desArg6,Ava14,15
SMILES [#6]-[#16]-[#6]-[#6]-[#6]-1-[#7]-[#6](=O)-[#6](-[#7])-[#6]-[#16]-[#16]-[#6]-[#6](-[#7]-[#6](=O)-[#6]-[#6]-[#6]-[#6]-[#7]-[#6](=O)-[#6](-[#6]-c2ccc(-[#8])cc2)-[#7]-[#6](=O)-[#6](-[#7]-[#6](=O)-[#6](-[#6]-[#6]-[#6]\[#7]=[#6](\[#7])-[#7])-[#7]-[#6](=O)-[#6]-[#7]-[#6](=O)-[#6](-[#6]-[#6](-[#6])-[#6])-[#7]-[#6]-1=O)-[#6](-[#6])-[#6])-[#6](-[#7])=O
InChI Key InChIKey=ZNCCWJWAHDKEFZ-UHFFFAOYSA-N
Data  4 KI
  Tab Delimited (TSV)   2D SDfile   Computed 3D by Vconf -m prep SDfile
Find this compound or compounds like it in BindingDB:
Activity Spreadsheet -- Enzyme Inhibition Constant Data from BindingDB
Found 4 hits for monomerid = 85945
TargetMelanin-concentrating hormone receptor 2(Homo sapiens (Human))
Merck Research Laboratories
Curated by PDSP Ki Database
LigandPNGBDBM85945(des(Ac-Arg6),Ava14,15 | desArg6,Ava14,15)
Affinity DataKi:  48nM
In DepthDetails ArticlePubMed
TargetMelanin-concentrating hormone receptor 2(Homo sapiens (Human))
Merck Research Laboratories
Curated by PDSP Ki Database
LigandPNGBDBM85945(des(Ac-Arg6),Ava14,15 | desArg6,Ava14,15)
Affinity DataKi:  77nM
In DepthDetails ArticlePubMed
TargetMelanin-concentrating hormone receptor 1(Homo sapiens (Human))
Merck Research Laboratories
Curated by PDSP Ki Database
LigandPNGBDBM85945(des(Ac-Arg6),Ava14,15 | desArg6,Ava14,15)
Affinity DataKi:  190nM
In DepthDetails ArticlePubMed
TargetMelanin-concentrating hormone receptor 1(Homo sapiens (Human))
Merck Research Laboratories
Curated by PDSP Ki Database
LigandPNGBDBM85945(des(Ac-Arg6),Ava14,15 | desArg6,Ava14,15)
Affinity DataKi:  300nM
In DepthDetails ArticlePubMed