BDBM85972 Gva6,desLeu9,Ava14,15
SMILES [#6]-[#16]-[#6]-[#6]-[#6]-1-[#7]-[#6](=O)-[#6](-[#6]-[#16]-[#16]-[#6]-[#6](-[#7]-[#6](=O)-[#6]-[#6]-[#6]-[#6]-[#7]-[#6](=O)-[#6](-[#6]-c2ccc(-[#8])cc2)-[#7]-[#6](=O)-[#6](-[#7]-[#6](=O)-[#6](-[#6]-[#6]-[#6]\[#7]=[#6](\[#7])-[#7])-[#7]-[#6](=O)-[#6]-[#7]-[#6]-1=O)-[#6](-[#6])-[#6])-[#6](-[#7])=O)-[#7]-[#6](=O)-[#6]-[#6]-[#6]-[#6]\[#7]=[#6](\[#7])-[#7]
InChI Key InChIKey=QRGXTAYSKPYRAP-UHFFFAOYSA-N
Data  2 KI
  Tab Delimited (TSV)   2D SDfile   Computed 3D by Vconf -m prep SDfile
Find this compound or compounds like it in BindingDB:
Activity Spreadsheet -- Enzyme Inhibition Constant Data from BindingDB
Found 2 hits for monomerid = 85972
TargetMelanin-concentrating hormone receptor 2(Homo sapiens (Human))
Merck Research Laboratories
Curated by PDSP Ki Database
LigandPNGBDBM85972(Gva6,desLeu9,Ava14,15)
Affinity DataKi:  20nM
In DepthDetails ArticlePubMed
TargetMelanin-concentrating hormone receptor 1(Homo sapiens (Human))
Merck Research Laboratories
Curated by PDSP Ki Database
LigandPNGBDBM85972(Gva6,desLeu9,Ava14,15)
Affinity DataKi:  1.35E+3nM
In DepthDetails ArticlePubMed