BDBM86059 CAS_6830::GTP::NSC_6830
SMILES Nc1nc2n(cnc2c(=O)[nH]1)C1OC(COP(O)(=O)OP(O)(=O)OP(O)(O)=O)C(O)C1O
InChI Key InChIKey=XKMLYUALXHKNFT-UHFFFAOYSA-N
Data  1 KI
PDB links: 1576 PDB IDs match this monomer.
  Tab Delimited (TSV)   2D SDfile   Computed 3D by Vconf -m prep SDfile
Find this compound or compounds like it in BindingDB:
Activity Spreadsheet -- Enzyme Inhibition Constant Data from BindingDB
Found 1 hit for monomerid = 86059
TargetFMRFamide-like neuropeptides 14(Ascaris)
Pharmacia
Curated by PDSP Ki Database
LigandPNGBDBM86059(CAS_6830 | GTP | NSC_6830)
Affinity DataKi:  10.5nM
In DepthDetails ArticlePubMed