BDBM86915 1-((6-bromopyridin-3-yloxy)methyl)-N-methylcyclopropanamine hydrochloride::CAS_45265980::NSC_45265980
SMILES CNC1(COc2ccc(Br)nc2)CC1
InChI Key InChIKey=JVOCKZNHCRFRCB-UHFFFAOYSA-N
Data  1 KI
  Tab Delimited (TSV)   2D SDfile   Computed 3D by Vconf -m prep SDfile
Find this compound or compounds like it in BindingDB:
Activity Spreadsheet -- Enzyme Inhibition Constant Data from BindingDB
Found 1 hit for monomerid = 86915
TargetNeuronal acetylcholine receptor subunit alpha-4(Rattus norvegicus (Rat))
Servier, Chemistry Research Division A
Curated by PDSP Ki Database
LigandPNGBDBM86915(1-((6-bromopyridin-3-yloxy)methyl)-N-methylcyclopr...)
Affinity DataKi:  38.8nM
In DepthDetails ArticlePubMed