BDBM86918 1-((6-chloropyridin-3-yloxy)methyl)-N-methylcyclopropanamine hydrochloride::CAS_9834778::NSC_9834778
SMILES CNC1(COc2ccc(Cl)nc2)CC1
InChI Key InChIKey=JWLQFBOPLOBNEV-UHFFFAOYSA-N
Data  1 KI
  Tab Delimited (TSV)   2D SDfile   Computed 3D by Vconf -m prep SDfile
Find this compound or compounds like it in BindingDB:
Activity Spreadsheet -- Enzyme Inhibition Constant Data from BindingDB
Found 1 hit for monomerid = 86918
TargetNeuronal acetylcholine receptor subunit alpha-4(Rattus norvegicus (Rat))
Servier, Chemistry Research Division A
Curated by PDSP Ki Database
LigandPNGBDBM86918(1-((6-chloropyridin-3-yloxy)methyl)-N-methylcyclop...)
Affinity DataKi:  13nM
In DepthDetails ArticlePubMed