BDBM88959 (4Z)-4-(3-bromo-4-hydroxy-5-methoxy-benzylidene)-1-(4-chlorophenyl)pyrazolidine-3,5-quinone::(4Z)-4-[(3-bromanyl-5-methoxy-4-oxidanyl-phenyl)methylidene]-1-(4-chlorophenyl)pyrazolidine-3,5-dione::(4Z)-4-[(3-bromo-4-hydroxy-5-methoxyphenyl)methylidene]-1-(4-chlorophenyl)pyrazolidine-3,5-dione::4-(3-Bromo-4-hydroxy-5-methoxy-benzylidene)-1-(4-chloro-phenyl)-pyrazolidine-3,5-dione::MLS001209859::SMR000514644::cid_1108983
SMILES COc1cc(\C=C2\C(=O)NN(C2=O)c2ccc(Cl)cc2)cc(Br)c1O
InChI Key InChIKey=PRCCJXJXZGPFRK-SDQBBNPISA-N
Data  2 IC50
  Tab Delimited (TSV)   2D SDfile   Computed 3D by Vconf -m prep SDfile
Find this compound or compounds like it in BindingDB:
Activity Spreadsheet -- Enzyme Inhibition Constant Data from BindingDB
Found 2 hits for monomerid = 88959
Target26S proteasome non-ATPase regulatory subunit 14(Homo sapiens (Human))
Burnham Center For Chemical Genomics
Curated by PubChem BioAssay
LigandPNGBDBM88959((4Z)-4-(3-bromo-4-hydroxy-5-methoxy-benzylidene)-1...)
Affinity DataIC50:  1.45E+4nM. Assay description: Data Source: Sanford-Burnham Center for Chemical Genomics (SBCCG) Source Affiliation: Sanford Burnham Medical Research Institute (SBMRI, La Jolla, CA...
In DepthDetails PCBioAssay
TargetProthrombin(Bos taurus (Bovine))
Burnham Center For Chemical Genomics
Curated by PubChem BioAssay
LigandPNGBDBM88959((4Z)-4-(3-bromo-4-hydroxy-5-methoxy-benzylidene)-1...)
Affinity DataIC50:  6.06E+4nM. Assay description: Data Source: Sanford-Burnham Center for Chemical Genomics (SBCCG) Source Affiliation: Sanford Burnham Medical Research Institute (SBMRI, La Jolla, CA...
In DepthDetails PCBioAssay