BDBM8995 N-benzyl-7-methyl-1,2,3,4-tetrahydroacridin-9-amine::Tacrine Analogue 12
SMILES Cc1ccc2nc3CCCCc3c(NCc3ccccc3)c2c1
InChI Key InChIKey=QBTINTSOUQAAND-UHFFFAOYSA-N
Data  1 IC50
  Tab Delimited (TSV)   2D SDfile   Computed 3D by Vconf -m prep SDfile
Find this compound or compounds like it in BindingDB:
Activity Spreadsheet -- Enzyme Inhibition Constant Data from BindingDB
Found 1 hit for monomerid = 8995
TargetAcetylcholinesterase(Homo sapiens (Human))
University Of Bologna
LigandPNGBDBM8995(N-benzyl-7-methyl-1,2,3,4-tetrahydroacridin-9-amin...)
Affinity DataIC50:  3.70E+3nMpH: 8.0 T: 2°C. Assay description: The cholinesterase assays were performed using colorimetric method reported by Ellman. The appearance of product was monitored at 412 nm for 5 min us...
In DepthDetails ArticlePubMed