BDBM9000 N-heptyl-7-methyl-1,2,3,4-tetrahydroacridin-9-amine::Tacrine Analogue 17
SMILES CCCCCCCNc1c2CCCCc2nc2ccc(C)cc12
InChI Key InChIKey=DKTDGXIXEAVNKX-UHFFFAOYSA-N
Data  2 IC50
  Tab Delimited (TSV)   2D SDfile   Computed 3D by Vconf -m prep SDfile
Find this compound or compounds like it in BindingDB:
Activity Spreadsheet -- Enzyme Inhibition Constant Data from BindingDB
Found 2 hits for monomerid = 9000
TargetAcetylcholinesterase(Homo sapiens (Human))
Sichuan University
Curated by ChEMBL
LigandPNGBDBM9000(N-heptyl-7-methyl-1,2,3,4-tetrahydroacridin-9-amin...)
Affinity DataIC50:  390nM. Assay description: Inhibition of AChE
In DepthDetails ArticlePubMed
TargetAcetylcholinesterase(Homo sapiens (Human))
Sichuan University
Curated by ChEMBL
LigandPNGBDBM9000(N-heptyl-7-methyl-1,2,3,4-tetrahydroacridin-9-amin...)
Affinity DataIC50:  390nMpH: 8.0 T: 2°C. Assay description: The cholinesterase assays were performed using colorimetric method reported by Ellman. The appearance of product was monitored at 412 nm for 5 min us...
In DepthDetails ArticlePubMed