BDBM9033 1H-Indole-3-carboxylic Acid [7-(6-Chloro-1,2,3,4-tetrahydroacridin-9-ylamino)heptyl]amide::Indole-Tacrine Heterodimer 16::N-{7-[(6-chloro-1,2,3,4-tetrahydroacridin-9-yl)amino]heptyl}-1H-indole-3-carboxamide
SMILES Clc1ccc2c(NCCCCCCCNC(=O)c3c[nH]c4ccccc34)c3CCCCc3nc2c1
InChI Key InChIKey=FAYCJMALFQZDBF-UHFFFAOYSA-N
Data  3 IC50
  Tab Delimited (TSV)   2D SDfile   Computed 3D by Vconf -m prep SDfile
Find this compound or compounds like it in BindingDB:
Activity Spreadsheet -- Enzyme Inhibition Constant Data from BindingDB
Found 3 hits for monomerid = 9033
TargetAcetylcholinesterase(Bos taurus (bovine))
Neuropharma
LigandPNGBDBM9033(1H-Indole-3-carboxylic Acid [7-(6-Chloro-1,2,3,4-t...)
Affinity DataIC50:  36nMpH: 8.0 T: 2°C. Assay description: The cholinesterase assays were performed using colorimetric method reported by Ellman. The absorbance changes at 405 nm were recorded for 5 min with ...
In DepthDetails ArticlePubMed
TargetAcetylcholinesterase(Homo sapiens (Human))
Sichuan University
Curated by ChEMBL
LigandPNGBDBM9033(1H-Indole-3-carboxylic Acid [7-(6-Chloro-1,2,3,4-t...)
Affinity DataIC50:  36nM. Assay description: Inhibition of AChE
In DepthDetails ArticlePubMed
TargetCholinesterase(Homo sapiens (Human))
Neuropharma
LigandPNGBDBM9033(1H-Indole-3-carboxylic Acid [7-(6-Chloro-1,2,3,4-t...)
Affinity DataIC50:  19nM. Assay description: The cholinesterase assays were performed using colorimetric method reported by Ellman. The absorbance changes at 405 nm were recorded for 5 min with ...
In DepthDetails ArticlePubMed